{"text_format":"1","workbook":"xlsx","n_sheets":5,"sheets":["TACC Competition","Group Tables","3rd Place","Teams","Marking Sheet"],"not_rendered":{"charts":0,"images":3,"macros":1,"external_links":0,"defined_names":0,"comments":0,"pivot_tables":0},"unopened":[],"bounds":{"document_bytes":16777216,"sheet_cells":100000,"rows_first":2000,"rows_last":500,"rows_between":2000,"halvings":0,"cell_chars":16384,"cell_head_chars":4096},"cells_cut":0,"cells_raw":0,"read":"whole","date_system":"1900"}

{"sheet":"TACC Competition","index":0,"n_rows":59,"n_cols":26,"rows_kept":59,"cut":false,"hidden":false,"merged":[[53,20,53,23],[54,20,54,23],[16,17,16,19],[16,20,16,23],[16,2,16,10],[25,9,25,18],[18,20,18,23],[47,20,47,23],[51,20,51,23],[46,20,46,23],[49,20,49,23],[1,1,3,4],[1,20,3,23],[18,9,18,18],[4,20,14,23],[13,1,13,4],[8,9,8,18],[7,9,7,18],[9,9,9,18],[10,9,11,18],[12,9,13,18],[5,1,11,4],[57,20,57,23],[58,20,58,23],[18,1,18,4],[32,1,32,4],[46,1,46,4],[36,20,36,23],[41,20,41,23],[29,20,29,23],[50,20,50,23],[45,20,45,23],[53,9,53,18],[46,9,46,18],[39,9,39,18],[32,9,32,18],[55,20,55,23],[39,20,39,23]]}
[null,null,null,null,null,null,null,null,null,null,null,null,null,null,null,null,null,null,null,null,null,"x"]
[null,"Instructions for Group Stages:",null,null,null,null,null,null,null,null,null,null,null,null,null,null,null,null,null,null,"Instructions for Knockout Stages:"]
[]
[]
[null,null,null,null,null,null,null,null,null,null,null,null,null,null,null,null,null,null,null,null,"Place an 'X' in the box next to the team you think will win each knockout match. The spreadsheet will do the work for you by progressing the relevant teams depending on your predictions. Bonus points are available for this part of the tournament and are detailed where necessary."]
[null,"Predict a score for each group stage match by entering values into the yellow boxes. The group table will automatically update depending on your predicted score and place the correct teams into the Knockout Stages. Please see the points table below:"]
[]
[null,null,null,null,null,null,null,null,null,"Hint: push the TACC logo to generate random group stage results!"]
[]
[null,null,null,null,null,null,null,null,null,"How to Enter"]
[null,null,null,null,null,null,null,null,null,"Please send £2 entry fee via PayPal to: ryanjohnstone67@hotmail.co.uk (via friends and family option)."]
[]
[null,null,null,null,null,null,null,null,null,"Completed forms to be sent electronically to the same e-mail address with proof of payment."]
[]
[]
{"$rows_left_out":45}
{"sheet":"Group Tables","index":1,"n_rows":36,"n_cols":13,"rows_kept":36,"cut":false,"hidden":true,"merged":[[1,12,1,13]]}
[]
["Rank","Team","P","W","D","L","GF","GA","+/-","Pts","Rank Criteria",null,"do not change these cells"]
[{"$f":"RANK(K3,$K$3:$K$6,0)+COUNTIF($K$3:$K3,$K3)-1","v":1},{"$f":"Teams!A1","v":"Turkey"},{"$f":"COUNTIFS('TACC Competition'!$B$20:'TACC Competition'!$B$59,'Group Tables'!B3,'TACC Competition'!$C$20:$C$59,\">=0\")+COUNTIFS('TACC Competition'!$D$20:$D$59,'Group Tables'!B3,'TACC Competition'!$E$20:$E$59,\">=0\")","v":0},{"$f":"COUNTIFS('TACC Competition'!$B$20:$B$59,'Group Tables'!B3,'TACC Competition'!$G$20:$G$59,3)+COUNTIFS('TACC Competition'!$D$20:$D$59,'Group Tables'!B3,'TACC Competition'!$H$20:$H$59,3)","v":0},{"$f":"COUNTIFS('TACC Competition'!$B$20:$B$59,'Group Tables'!B3,'TACC Competition'!$G$20:$G$59,1)+COUNTIFS('TACC Competition'!$D$20:$D$59,'Group Tables'!B3,'TACC Competition'!$H$20:$H$59,1)","v":0},{"$f":"COUNTIFS('TACC Competition'!$B$20:$B$59,'Group Tables'!B3,'TACC Competition'!$G$20:$G$59,0)+COUNTIFS('TACC Competition'!$D$20:$D$59,'Group Tables'!B3,'TACC Competition'!$H$20:$H$59,0)","v":0},{"$f":"SUMIF('TACC Competition'!$B$20:$B$59,'Group Tables'!B3,'TACC Competition'!$C$20:$C$59)+SUMIF('TACC Competition'!$D$20:$D$59,'Group Tables'!B3,'TACC Competition'!$E$20:$E$59)","v":0},{"$f":"SUMIF('TACC Competition'!$B$20:$B$59,'Group Tables'!B3,'TACC Competition'!$E$20:$E$59)+SUMIF('TACC Competition'!$D$20:$D$59,'Group Tables'!B3,'TACC Competition'!$C$20:$C$59)","v":0},{"$f":"G3-H3","v":0},{"$f":"SUM((D3*3)+E3)","v":0},{"$f":"SUM(J3*1000000+I3*10000+G3*100+D3*10)","v":0}]
[{"$f":"RANK(K4,$K$3:$K$6,0)+COUNTIF($K$3:$K4,$K4)-1","v":2},{"$f":"Teams!A2","v":"Italy"},{"$f":"COUNTIFS('TACC Competition'!$B$20:'TACC Competition'!$B$59,'Group Tables'!B4,'TACC Competition'!$C$20:$C$59,\">=0\")+COUNTIFS('TACC Competition'!$D$20:$D$59,'Group Tables'!B4,'TACC Competition'!$E$20:$E$59,\">=0\")","v":0},{"$f":"COUNTIFS('TACC Competition'!$B$20:$B$59,'Group Tables'!B4,'TACC Competition'!$G$20:$G$59,3)+COUNTIFS('TACC Competition'!$D$20:$D$59,'Group Tables'!B4,'TACC Competition'!$H$20:$H$59,3)","v":0},{"$f":"COUNTIFS('TACC Competition'!$B$20:$B$59,'Group Tables'!B4,'TACC Competition'!$G$20:$G$59,1)+COUNTIFS('TACC Competition'!$D$20:$D$59,'Group Tables'!B4,'TACC Competition'!$H$20:$H$59,1)","v":0},{"$f":"COUNTIFS('TACC Competition'!$B$20:$B$59,'Group Tables'!B4,'TACC Competition'!$G$20:$G$59,0)+COUNTIFS('TACC Competition'!$D$20:$D$59,'Group Tables'!B4,'TACC Competition'!$H$20:$H$59,0)","v":0},{"$f":"SUMIF('TACC Competition'!$B$20:$B$59,'Group Tables'!B4,'TACC Competition'!$C$20:$C$59)+SUMIF('TACC Competition'!$D$20:$D$59,'Group Tables'!B4,'TACC Competition'!$E$20:$E$59)","v":0},{"$f":"SUMIF('TACC Competition'!$B$20:$B$59,'Group Tables'!B4,'TACC Competition'!$E$20:$E$59)+SUMIF('TACC Competition'!$D$20:$D$59,'Group Tables'!B4,'TACC Competition'!$C$20:$C$59)","v":0},{"$f":"G4-H4","v":0},{"$f":"SUM((D4*3)+E4)","v":0},{"$f":"SUM(J4*1000000+I4*10000+G4*100+D4*10)","v":0}]
[{"$f":"RANK(K5,$K$3:$K$6,0)+COUNTIF($K$3:$K5,$K5)-1","v":3},{"$f":"Teams!A3","v":"Wales"},{"$f":"COUNTIFS('TACC Competition'!$B$20:'TACC Competition'!$B$59,'Group Tables'!B5,'TACC Competition'!$C$20:$C$59,\">=0\")+COUNTIFS('TACC Competition'!$D$20:$D$59,'Group Tables'!B5,'TACC Competition'!$E$20:$E$59,\">=0\")","v":0},{"$f":"COUNTIFS('TACC Competition'!$B$20:$B$59,'Group Tables'!B5,'TACC Competition'!$G$20:$G$59,3)+COUNTIFS('TACC Competition'!$D$20:$D$59,'Group Tables'!B5,'TACC Competition'!$H$20:$H$59,3)","v":0},{"$f":"COUNTIFS('TACC Competition'!$B$20:$B$59,'Group Tables'!B5,'TACC Competition'!$G$20:$G$59,1)+COUNTIFS('TACC Competition'!$D$20:$D$59,'Group Tables'!B5,'TACC Competition'!$H$20:$H$59,1)","v":0},{"$f":"COUNTIFS('TACC Competition'!$B$20:$B$59,'Group Tables'!B5,'TACC Competition'!$G$20:$G$59,0)+COUNTIFS('TACC Competition'!$D$20:$D$59,'Group Tables'!B5,'TACC Competition'!$H$20:$H$59,0)","v":0},{"$f":"SUMIF('TACC Competition'!$B$20:$B$59,'Group Tables'!B5,'TACC Competition'!$C$20:$C$59)+SUMIF('TACC Competition'!$D$20:$D$59,'Group Tables'!B5,'TACC Competition'!$E$20:$E$59)","v":0},{"$f":"SUMIF('TACC Competition'!$B$20:$B$59,'Group Tables'!B5,'TACC Competition'!$E$20:$E$59)+SUMIF('TACC Competition'!$D$20:$D$59,'Group Tables'!B5,'TACC Competition'!$C$20:$C$59)","v":0},0,{"$f":"SUM((D5*3)+E5)","v":0},0]
[{"$f":"RANK(K6,$K$3:$K$6,0)+COUNTIF($K$3:$K6,$K6)-1","v":4},{"$f":"Teams!A4","v":"Switzerland"},{"$f":"COUNTIFS('TACC Competition'!$B$20:'TACC Competition'!$B$59,'Group Tables'!B6,'TACC Competition'!$C$20:$C$59,\">=0\")+COUNTIFS('TACC Competition'!$D$20:$D$59,'Group Tables'!B6,'TACC Competition'!$E$20:$E$59,\">=0\")","v":0},{"$f":"COUNTIFS('TACC Competition'!$B$20:$B$59,'Group Tables'!B6,'TACC Competition'!$G$20:$G$59,3)+COUNTIFS('TACC Competition'!$D$20:$D$59,'Group Tables'!B6,'TACC Competition'!$H$20:$H$59,3)","v":0},{"$f":"COUNTIFS('TACC Competition'!$B$20:$B$59,'Group Tables'!B6,'TACC Competition'!$G$20:$G$59,1)+COUNTIFS('TACC Competition'!$D$20:$D$59,'Group Tables'!B6,'TACC Competition'!$H$20:$H$59,1)","v":0},{"$f":"COUNTIFS('TACC Competition'!$B$20:$B$59,'Group Tables'!B6,'TACC Competition'!$G$20:$G$59,0)+COUNTIFS('TACC Competition'!$D$20:$D$59,'Group Tables'!B6,'TACC Competition'!$H$20:$H$59,0)","v":0},{"$f":"SUMIF('TACC Competition'!$B$20:$B$59,'Group Tables'!B6,'TACC Competition'!$C$20:$C$59)+SUMIF('TACC Competition'!$D$20:$D$59,'Group Tables'!B6,'TACC Competition'!$E$20:$E$59)","v":0},{"$f":"SUMIF('TACC Competition'!$B$20:$B$59,'Group Tables'!B6,'TACC Competition'!$E$20:$E$59)+SUMIF('TACC Competition'!$D$20:$D$59,'Group Tables'!B6,'TACC Competition'!$C$20:$C$59)","v":0},0,{"$f":"SUM((D6*3)+E6)","v":0},0]
[]
["Rank","Team","P","W","D","L","GF","GA","+/-","Pts","Rank Criteria"]
[{"$f":"RANK(K9,$K$9:$K$12,0)+COUNTIF($K$9:$K9,$K9)-1","v":1},{"$f":"Teams!D1","v":"Denmark"},{"$f":"COUNTIFS('TACC Competition'!$B$20:$B$59,'Group Tables'!B9,'TACC Competition'!$C$20:$C$59,\">=0\")+COUNTIFS('TACC Competition'!$D$20:$D$59,'Group Tables'!B9,'TACC Competition'!$E$20:$E$59,\">=0\")","v":0},{"$f":"COUNTIFS('TACC Competition'!$B$20:$B$59,'Group Tables'!B9,'TACC Competition'!$G$20:$G$59,3)+COUNTIFS('TACC Competition'!$D$20:$D$59,'Group Tables'!B9,'TACC Competition'!$H$20:$H$59,3)","v":0},{"$f":"COUNTIFS('TACC Competition'!$B$20:$B$59,'Group Tables'!B9,'TACC Competition'!$G$20:$G$59,1)+COUNTIFS('TACC Competition'!$D$20:$D$59,'Group Tables'!B9,'TACC Competition'!$H$20:$H$59,1)","v":0},{"$f":"COUNTIFS('TACC Competition'!$B$20:$B$59,'Group Tables'!B9,'TACC Competition'!$G$20:$G$59,0)+COUNTIFS('TACC Competition'!$D$20:$D$59,'Group Tables'!B9,'TACC Competition'!$H$20:$H$59,0)","v":0},{"$f":"SUMIF('TACC Competition'!$B$20:$B$59,'Group Tables'!B9,'TACC Competition'!$C$20:$C$59)+SUMIF('TACC Competition'!$D$20:$D$59,'Group Tables'!B9,'TACC Competition'!$E$20:$E$59)","v":0},{"$f":"SUMIF('TACC Competition'!$B$20:$B$59,'Group Tables'!B9,'TACC Competition'!$E$20:$E$59)+SUMIF('TACC Competition'!$D$20:$D$59,'Group Tables'!B9,'TACC Competition'!$C$20:$C$59)","v":0},{"$f":"G9-H9","v":0},{"$f":"SUM((D9*3)+E9)","v":0},{"$f":"SUM(J9*1000000+I9*10000+G9*100+D9*10)","v":0}]
[{"$f":"RANK(K10,$K$9:$K$12,0)+COUNTIF($K$9:$K10,$K10)-1","v":2},{"$f":"Teams!D2","v":"Finland"},{"$f":"COUNTIFS('TACC Competition'!$B$20:$B$59,'Group Tables'!B10,'TACC Competition'!$C$20:$C$59,\">=0\")+COUNTIFS('TACC Competition'!$D$20:$D$59,'Group Tables'!B10,'TACC Competition'!$E$20:$E$59,\">=0\")","v":0},{"$f":"COUNTIFS('TACC Competition'!$B$20:$B$59,'Group Tables'!B10,'TACC Competition'!$G$20:$G$59,3)+COUNTIFS('TACC Competition'!$D$20:$D$59,'Group Tables'!B10,'TACC Competition'!$H$20:$H$59,3)","v":0},{"$f":"COUNTIFS('TACC Competition'!$B$20:$B$59,'Group Tables'!B10,'TACC Competition'!$G$20:$G$59,1)+COUNTIFS('TACC Competition'!$D$20:$D$59,'Group Tables'!B10,'TACC Competition'!$H$20:$H$59,1)","v":0},{"$f":"COUNTIFS('TACC Competition'!$B$20:$B$59,'Group Tables'!B10,'TACC Competition'!$G$20:$G$59,0)+COUNTIFS('TACC Competition'!$D$20:$D$59,'Group Tables'!B10,'TACC Competition'!$H$20:$H$59,0)","v":0},{"$f":"SUMIF('TACC Competition'!$B$20:$B$59,'Group Tables'!B10,'TACC Competition'!$C$20:$C$59)+SUMIF('TACC Competition'!$D$20:$D$59,'Group Tables'!B10,'TACC Competition'!$E$20:$E$59)","v":0},{"$f":"SUMIF('TACC Competition'!$B$20:$B$59,'Group Tables'!B10,'TACC Competition'!$E$20:$E$59)+SUMIF('TACC Competition'!$D$20:$D$59,'Group Tables'!B10,'TACC Competition'!$C$20:$C$59)","v":0},{"$f":"G10-H10","v":0},{"$f":"SUM((D10*3)+E10)","v":0},{"$f":"SUM(J10*1000000+I10*10000+G10*100+D10*10)","v":0}]
[{"$f":"RANK(K11,$K$9:$K$12,0)+COUNTIF($K$9:$K11,$K11)-1","v":3},{"$f":"Teams!D3","v":"Belgium"},{"$f":"COUNTIFS('TACC Competition'!$B$20:$B$59,'Group Tables'!B11,'TACC Competition'!$C$20:$C$59,\">=0\")+COUNTIFS('TACC Competition'!$D$20:$D$59,'Group Tables'!B11,'TACC Competition'!$E$20:$E$59,\">=0\")","v":0},{"$f":"COUNTIFS('TACC Competition'!$B$20:$B$59,'Group Tables'!B11,'TACC Competition'!$G$20:$G$59,3)+COUNTIFS('TACC Competition'!$D$20:$D$59,'Group Tables'!B11,'TACC Competition'!$H$20:$H$59,3)","v":0},{"$f":"COUNTIFS('TACC Competition'!$B$20:$B$59,'Group Tables'!B11,'TACC Competition'!$G$20:$G$59,1)+COUNTIFS('TACC Competition'!$D$20:$D$59,'Group Tables'!B11,'TACC Competition'!$H$20:$H$59,1)","v":0},{"$f":"COUNTIFS('TACC Competition'!$B$20:$B$59,'Group Tables'!B11,'TACC Competition'!$G$20:$G$59,0)+COUNTIFS('TACC Competition'!$D$20:$D$59,'Group Tables'!B11,'TACC Competition'!$H$20:$H$59,0)","v":0},{"$f":"SUMIF('TACC Competition'!$B$20:$B$59,'Group Tables'!B11,'TACC Competition'!$C$20:$C$59)+SUMIF('TACC Competition'!$D$20:$D$59,'Group Tables'!B11,'TACC Competition'!$E$20:$E$59)","v":0},{"$f":"SUMIF('TACC Competition'!$B$20:$B$59,'Group Tables'!B11,'TACC Competition'!$E$20:$E$59)+SUMIF('TACC Competition'!$D$20:$D$59,'Group Tables'!B11,'TACC Competition'!$C$20:$C$59)","v":0},0,{"$f":"SUM((D11*3)+E11)","v":0},0]
[{"$f":"RANK(K12,$K$9:$K$12,0)+COUNTIF($K$9:$K12,$K12)-1","v":4},{"$f":"Teams!D4","v":"Russia"},{"$f":"COUNTIFS('TACC Competition'!$B$20:$B$59,'Group Tables'!B12,'TACC Competition'!$C$20:$C$59,\">=0\")+COUNTIFS('TACC Competition'!$D$20:$D$59,'Group Tables'!B12,'TACC Competition'!$E$20:$E$59,\">=0\")","v":0},{"$f":"COUNTIFS('TACC Competition'!$B$20:$B$59,'Group Tables'!B12,'TACC Competition'!$G$20:$G$59,3)+COUNTIFS('TACC Competition'!$D$20:$D$59,'Group Tables'!B12,'TACC Competition'!$H$20:$H$59,3)","v":0},{"$f":"COUNTIFS('TACC Competition'!$B$20:$B$59,'Group Tables'!B12,'TACC Competition'!$G$20:$G$59,1)+COUNTIFS('TACC Competition'!$D$20:$D$59,'Group Tables'!B12,'TACC Competition'!$H$20:$H$59,1)","v":0},{"$f":"COUNTIFS('TACC Competition'!$B$20:$B$59,'Group Tables'!B12,'TACC Competition'!$G$20:$G$59,0)+COUNTIFS('TACC Competition'!$D$20:$D$59,'Group Tables'!B12,'TACC Competition'!$H$20:$H$59,0)","v":0},{"$f":"SUMIF('TACC Competition'!$B$20:$B$59,'Group Tables'!B12,'TACC Competition'!$C$20:$C$59)+SUMIF('TACC Competition'!$D$20:$D$59,'Group Tables'!B12,'TACC Competition'!$E$20:$E$59)","v":0},{"$f":"SUMIF('TACC Competition'!$B$20:$B$59,'Group Tables'!B12,'TACC Competition'!$E$20:$E$59)+SUMIF('TACC Competition'!$D$20:$D$59,'Group Tables'!B12,'TACC Competition'!$C$20:$C$59)","v":0},0,{"$f":"SUM((D12*3)+E12)","v":0},0]
[]
["Rank","Team","P","W","D","L","GF","GA","+/-","Pts","Rank Criteria"]
[{"$f":"RANK(K15,$K$15:$K$18,0)+COUNTIF($K$15:$K15,$K15)-1","v":1},{"$f":"Teams!G1","v":"Netherlands"},{"$f":"COUNTIFS('TACC Competition'!$B$20:$B$59,'Group Tables'!B15,'TACC Competition'!$C$20:$C$59,\">=0\")+COUNTIFS('TACC Competition'!$D$20:$D$59,'Group Tables'!B15,'TACC Competition'!$E$20:$E$59,\">=0\")","v":0},{"$f":"COUNTIFS('TACC Competition'!$B$20:$B$59,'Group Tables'!B15,'TACC Competition'!$G$20:$G$59,3)+COUNTIFS('TACC Competition'!$D$20:$D$59,'Group Tables'!B15,'TACC Competition'!$H$20:$H$59,3)","v":0},{"$f":"COUNTIFS('TACC Competition'!$B$20:$B$59,'Group Tables'!B15,'TACC Competition'!$G$20:$G$59,1)+COUNTIFS('TACC Competition'!$D$20:$D$59,'Group Tables'!B15,'TACC Competition'!$H$20:$H$59,1)","v":0},{"$f":"COUNTIFS('TACC Competition'!$B$20:$B$59,'Group Tables'!B15,'TACC Competition'!$G$20:$G$59,0)+COUNTIFS('TACC Competition'!$D$20:$D$59,'Group Tables'!B15,'TACC Competition'!$H$20:$H$59,0)","v":0},{"$f":"SUMIF('TACC Competition'!$B$20:$B$59,'Group Tables'!B15,'TACC Competition'!$C$20:$C$59)+SUMIF('TACC Competition'!$D$20:$D$59,'Group Tables'!B15,'TACC Competition'!$E$20:$E$59)","v":0},{"$f":"SUMIF('TACC Competition'!$B$20:$B$59,'Group Tables'!B15,'TACC Competition'!$E$20:$E$59)+SUMIF('TACC Competition'!$D$20:$D$59,'Group Tables'!B15,'TACC Competition'!$C$20:$C$59)","v":0},{"$f":"G15-H15","v":0},{"$f":"SUM((D15*3)+E15)","v":0},{"$f":"SUM(J15*1000000+I15*10000+G15*100+D15*10)","v":0}]
{"$rows_left_out":22}
{"sheet":"3rd Place","index":2,"n_rows":9,"n_cols":11,"rows_kept":9,"cut":false,"hidden":true,"merged":[[8,1,8,2]]}
["A",1,{"$f":"VLOOKUP(E1,'Group Tables'!B3:K6,10,0)","v":0},"A",{"$f":"'TACC Competition'!K23","v":"Wales"},{"$f":"RANK(C1,$C$1:$C$6,0)+COUNTIF($C$1:$C1,$C1)-1","v":1},{"$f":"D1","v":"A"},{"$f":"VLOOKUP(B1,$F$1:$G$6,2,0)","v":"A"},{"$f":"COUNTIF($H$1:$H$4,\"<=\"&H1)","v":1},{"$f":"INDEX($H$1:$H$4,MATCH(ROWS($I$1:I1),$I$1:$I$4,0))","v":"A"}]
["B",2,{"$f":"VLOOKUP(E2,'Group Tables'!B9:K12,10,0)","v":0},"B",{"$f":"'TACC Competition'!K30","v":"Belgium"},{"$f":"RANK(C2,$C$1:$C$6,0)+COUNTIF($C$1:$C2,$C2)-1","v":2},"B",{"$f":"VLOOKUP(B2,$F$1:$G$6,2,0)","v":"B"},{"$f":"COUNTIF($H$1:$H$4,\"<=\"&H2)","v":2},{"$f":"INDEX($H$1:$H$4,MATCH(ROWS($I$1:I2),$I$1:$I$4,0))","v":"B"}]
["C",3,{"$f":"VLOOKUP(E3,'Group Tables'!B15:K18,10,0)","v":0},"C",{"$f":"'TACC Competition'!K37","v":"Austria"},{"$f":"RANK(C3,$C$1:$C$6,0)+COUNTIF($C$1:$C3,$C3)-1","v":3},"C","C",3,{"$f":"INDEX($H$1:$H$4,MATCH(ROWS($I$1:I3),$I$1:$I$4,0))","v":"C"}]
["D",4,{"$f":"VLOOKUP(E4,'Group Tables'!B21:K24,10,0)","v":0},"D",{"$f":"'TACC Competition'!K44","v":"Scotland"},{"$f":"RANK(C4,$C$1:$C$6,0)+COUNTIF($C$1:$C4,$C4)-1","v":4},"D","D",4,{"$f":"INDEX($H$1:$H$4,MATCH(ROWS($I$1:I4),$I$1:$I$4,0))","v":"D"}]
["E",5,{"$f":"VLOOKUP(E5,'Group Tables'!B27:K30,10,0)","v":0},"E",{"$f":"'TACC Competition'!K51","v":"Poland"},{"$f":"RANK(C5,$C$1:$C$6,0)+COUNTIF($C$1:$C5,$C5)-1","v":5},"E"]
["F",6,{"$f":"VLOOKUP(E6,'Group Tables'!B33:K36,10,0)","v":0},"F",{"$f":"'TACC Competition'!K58","v":"France"},{"$f":"RANK(C6,$C$1:$C$6,0)+COUNTIF($C$1:$C6,$C6)-1","v":6},"F",null,null,null,{"$f":"IF('TACC Competition'!L59>0,CONCATENATE(J1,J2,J3,J4),0)","v":0}]
[]
[]
[null,"do not change these cells"]

{"sheet":"Teams","index":3,"n_rows":10,"n_cols":11,"rows_kept":10,"cut":false,"hidden":true,"merged":[]}
["Turkey","A1",null,"Denmark","B1",null,"Netherlands","C1",null,"input (list)","X"]
["Italy","A2",null,"Finland","B2",null,"Ukraine","C2"]
["Wales","A3",null,"Belgium","B3",null,"Austria","C3"]
["Switzerland","A4",null,"Russia","B4",null,"North Macedonia","C4"]
[]
[]
["England","D1",null,"Spain","E1",null,"Hungary","F1"]
["Croatia","D2",null,"Sweden","E2",null,"Portugal","F2"]
["Scotland","D3",null,"Poland","E3",null,"France","F3"]
["Czech Republic","D4",null,"Slovakia","E4",null,"Germany","F4"]

{"sheet":"Marking Sheet","index":4,"n_rows":40,"n_cols":7,"rows_kept":40,"cut":false,"hidden":true,"merged":[]}
[]
[null,"NAME",null,{"$f":"'TACC Competition'!C17","v":0}]
[]
[null,"PREDICTIONS",null,null,null,null,"PREDICTIONS"]
[null,{"$f":"'TACC Competition'!B20","v":"Turkey"},{"$f":"'TACC Competition'!C20","v":0},{"$f":"'TACC Competition'!E20","v":0},{"$f":"'TACC Competition'!D20","v":"Italy"},null,{"$f":"'TACC Competition'!U38","v":"Winner QF (1)"}]
[null,{"$f":"'TACC Competition'!B21","v":"Wales"},{"$f":"'TACC Competition'!C21","v":0},{"$f":"'TACC Competition'!E21","v":0},{"$f":"'TACC Competition'!D21","v":"Switzerland"},null,{"$f":"'TACC Competition'!W38","v":"Winner QF (2)"}]
[null,{"$f":"'TACC Competition'!B22","v":"Denmark"},{"$f":"'TACC Competition'!C22","v":0},{"$f":"'TACC Competition'!E22","v":0},{"$f":"'TACC Competition'!D22","v":"Finland"},null,{"$f":"'TACC Competition'!U39","v":"Winner QF (3)"}]
[null,{"$f":"'TACC Competition'!B23","v":"Belgium"},{"$f":"'TACC Competition'!C23","v":0},{"$f":"'TACC Competition'!E23","v":0},{"$f":"'TACC Competition'!D23","v":"Russia"},null,{"$f":"'TACC Competition'!W39","v":"Winner QF (4)"}]
[null,{"$f":"'TACC Competition'!B24","v":"Netherlands"},{"$f":"'TACC Competition'!C24","v":0},{"$f":"'TACC Competition'!E24","v":0},{"$f":"'TACC Competition'!D24","v":"Ukraine"},null,"WINNER"]
[null,{"$f":"'TACC Competition'!B25","v":"Austria"},{"$f":"'TACC Competition'!C25","v":0},{"$f":"'TACC Competition'!E25","v":0},{"$f":"'TACC Competition'!D25","v":"North Macedonia"},null,{"$f":"'TACC Competition'!U47","v":""}]
[null,{"$f":"'TACC Competition'!B26","v":"England"},{"$f":"'TACC Competition'!C26","v":0},{"$f":"'TACC Competition'!E26","v":0},{"$f":"'TACC Competition'!D26","v":"Croatia"},null,"TOP GOALSCORER"]
[null,{"$f":"'TACC Competition'!B27","v":"Scotland"},{"$f":"'TACC Competition'!C27","v":0},{"$f":"'TACC Competition'!E27","v":0},{"$f":"'TACC Competition'!D27","v":"Czech Republic"},null,{"$f":"'TACC Competition'!U51","v":0}]
[null,{"$f":"'TACC Competition'!B28","v":"Spain"},{"$f":"'TACC Competition'!C28","v":0},{"$f":"'TACC Competition'!E28","v":0},{"$f":"'TACC Competition'!D28","v":"Sweden"}]
[null,{"$f":"'TACC Competition'!B29","v":"Poland"},{"$f":"'TACC Competition'!C29","v":0},{"$f":"'TACC Competition'!E29","v":0},{"$f":"'TACC Competition'!D29","v":"Slovakia"}]
[null,{"$f":"'TACC Competition'!B30","v":"Hungary"},{"$f":"'TACC Competition'!C30","v":0},{"$f":"'TACC Competition'!E30","v":0},{"$f":"'TACC Competition'!D30","v":"Portugal"}]
{"$rows_left_out":25}